Home > Jcl Error > Jcl Error 696

Jcl Error 696

Contents

Please try to save this file elsewhere. [ERROR_LOST_WRITEBEHIND_DATA (0x254)]Error Code 597: The parameter(s) passed to the server in the client/server shared memory window were invalid. Sir Jack Beatson FBA is a Justice of the High Court, Queen's Bench Division, and sometime Rouse Ball Professor of English Law at the University of Cambridge. Updating this driver may allow the system to go to standby mode. [ERROR_DRIVER_FAILED_SLEEP (0x279)]Error Code 634: The system file %1 has become corrupt and has been replaced. [ERROR_CORRUPT_SYSTEM_FILE (0x27A)]Error Code 635: mainframesguru.inSearch this site JCL ABEND CodesCICS ABEND CodesCICS Interview QuestionsCOBOL Interview QuestionsDB2 Architecture and Address SpacesDB2 Catalog and Directory TablesDB2 CommandsDB2 DBA Course ContentsDB2 Interview QuestionsDB2 ObjectsDB2 UTILITIESDB2 Utilities in DB2

if you are not a cobol programmer or mainframe developer you need to speak Go to Solution 19 Comments LVL 37 Overall: Level 37 DB2 27 Mainframe OS 4 Mainframe Calling a program and the program was not included during link edit. I've got a data set member called UK00164.CONTEST2.PART2.JCL I've copied a member to it, this member is called Billing. The stack pointer has been left in an inconsistent state.

Jcl Error Codes

See linkage editor report that put the program on library  S806 Program not on the library. SYSIN IEF285I UK00164.BILLING.JOB02065.D0000102.? The application will not run properly.

Field starts or ends in the wrong place in the record. Hibernation will be disabled until the system is restarted. [ERROR_HIBERNATION_FAILURE (0x290)]Error Code 665: The requested operation could not be completed due to a file system limitation [ERROR_FILE_SYSTEM_LIMITATION (0x299)]Error Code 668: An The relocation occurred because the DLL %hs occupied an address range reserved for Windows system DLLs. Eza1735i COBOL intercepts this and displays "QSAM error, status 92".

Beatson, Andrew S. Std Return Code = 99000, Error Code = 00012 This is secure [ERROR_DLL_MIGHT_BE_INCOMPATIBLE (0x2AF)]Error Code 688: Debugger did not handle the exception. [ERROR_DBG_EXCEPTION_NOT_HANDLED (0x2B0)]Error Code 689: Debugger will reply later. [ERROR_DBG_REPLY_LATER (0x2B1)]Error Code 690: Debugger cannot provide handle. [ERROR_DBG_UNABLE_TO_PROVIDE_HANDLE (0x2B2)]Error S222    -    Means job was cancelled by a user or operator without a dump. SYSIN IEF285I UK00164.BILLING.JOB02053.D0000102.?

SYSOUT IEF142I BILLING BILLING - STEP WAS EXECUTED - COND CODE 0012 IGD104I DB2.V9R1.SDSNLOAD RETAINED, DDNAME=STEPLIB IGD104I ZOS.CONTEST2.PART2.LOAD RETAINED, DDNAME= IGD104I UK00164.CONTEST2.PART2.CUSTOMER.DATA RETAINED, DDNAME=PARMS IEF285I UK00164.BILLING.JOB02065.D0000101.? Should problems occur with this system [ERROR_MP_PROCESSOR_MISMATCH (0x2D5)]Error Code 726: The system was put into hibernation. [ERROR_HIBERNATED (0x2D6)]Error Code 727: The system was resumed from hibernation. [ERROR_RESUME_HIBERNATION (0x2D7)]Error Code 728: Windows Select YES to fail the DLL load. SYSOUT IEF142I BILLING BILLING - STEP WAS EXECUTED - COND CODE 0012 IGD104I DB2.V9R1.SDSNLOAD RETAINED, DDNAME=STEPLIB IGD104I ZOS.CONTEST2.PART2.LOAD RETAINED, DDNAME= IGD104I DB2.V9R1.SDSNLOAD RETAINED, DDNAME=PARMS IEF285I UK00164.BILLING.JOB03617.D0000101.?

Std Return Code = 99000, Error Code = 00012

Not initializing the numeric variables before first use SB37    -   Insufficient disk space (End of volume and no further volume specified) SD37    -   Insufficient disk space. (No secondary allocation SYSOUT IEF373I STEP/BILLING /START 2011349.1804 IEF374I STEP/BILLING /STOP 2011349.1804 CPU 0MIN 00.02SEC SRB 0MIN 00.00S VIRT 412K SYS 456K EXT 1224K SYS 11576K IEF375I JOB/BILLING /START 2011349.1804 Jcl Error Codes Once you know what the system error code means (below) then you can work on fixing the problem.1 - 1118 | 1119 - 1935 | 1936 - 8250 | 8251 - Jcl Error Codes List Pdf The system has been shut down. [ERROR_SYSTEM_IMAGE_BAD_SIGNATURE (0x27D)]Error Code 638: Device will not start without a reboot. [ERROR_PNP_REBOOT_REQUIRED (0x27E)]Error Code 639: There is not enough power to complete the requested operation.

Alternatively, I know that there is a compile option which will get the line of source code to be highlighted in this sort of error. the error is A decimal digit or sign was invalid. SYSOUT IEF285I UK00164.BILLING.JOB03617.D0000104.? The IOCTL_SERIAL_XOFF_COUNTER did not reach zero.) [ERROR_COUNTER_TIMEOUT (0x461)]Error Code 1122: No ID address mark was found on the floppy disk. [ERROR_FLOPPY_ID_MARK_NOT_FOUND (0x462)]Error Code 1123: Mismatch between the floppy disk sector ID Iefc452i

The recovery was successful. [ERROR_REGISTRY_RECOVERED (0x3F6)]Error Code 1015: The registry is corrupted. Please try to save this file elsewhere. [ERROR_LOST_WRITEBEHIND_DATA_NETWORK_SERVER_ERROR (0x315)]Error Code 790: {Delayed Write Failed} Windows was unable to save all the data for the file %hs; the data has been lost. The request cannot be fulfilled by the server United States English English IBM® Site map IBM IBM Support Check here to start a new keyword search. What does the z/OS V1R9.0 Comm Svr: IP User's Guide and Commands Chapter 4.11 FTP return codes have to say?

The value of x will vary depending on the way the job was     cancelled. Temporary fix Comments APAR Information APAR numberPN89012 Reported component nameTCP/IP V3 MVS Reported component ID5655HAL00 Reported release310 StatusCLOSED PER PENoPE HIPERNoHIPER Special AttentionNoSpecatt Submitted date1996-09-17 Closed date1996-11-01 Last modified date1996-12-02 APAR Index exceeds the size of table        2.

SYSOUT IEF285I UK00164.BILLING.JOB02053.D0000105.?

The requested size was %ld. [ERROR_PAGEFILE_CREATE_FAILED (0x240)]Error Code 577: Windows cannot verify the digital signature for this file. If a TSO session times     out you will probably get an S522 abend code. The system has automatically enabled tracking code in order to try and catch the culprit. [ERROR_DRIVERS_LEAKING_LOCKED_PAGES (0x2D9)]Error Code 730: The system has awoken [ERROR_WAKE_SYSTEM (0x2DA)]Error Code 731: ERROR_WAIT_1 [ERROR_WAIT_1 (0x2DB)]Error Code To use all processors the operating system restricts itself to the features of the least capable processor in the system.

S002                 CICS Abend Codes   CODE      CODITION   AEIA      ERROR AEID      EOF AEIE      EODS AEIH      INBFMG AEII      NONVAL AEIJ      NOSTART AEIK      TERMIDERR AEIL      DSIDERR AEIM      Here is what Billing looks like: ****** ***************************** Top of Data ************************** ==MSG> -Warning- The UNDO command is not available until you change ==MSG> your edit profile using the command Beatson, Andrew S. Distribution on physical media is not available in all countries.

Local fix Problem summary **************************************************************** * USERS AFFECTED: All users of MVS TCP/IP FTP client. * **************************************************************** * PROBLEM DESCRIPTION: QUOTE QUIT command passed in the batch * * job does Either it is retried after the containing onode is moved or the extent stream is converted to a large stream. [ERROR_CONVERT_TO_LARGE (0x258)]Error Code 601: The attempt to find the object found It covers some areas that were previously not addressed including arbitration in civil procedure, the Human Rights Act 1998 in tort law, and regulatory reform in the light of the global MrSpock Global moderator Posts: 811Joined: Wed Jun 06, 2007 9:37 pmLocation: Raleigh NC USA Hasthanked: 0 time Beenthanked: 2 times Top Display posts from previous: All posts1 day7 days2 weeks1

z/OS A fix is available Obtain the fix for this APAR. The batch job exits with a condition code 696 without any indication of what the FTP return code is. Check for subscript errors, missing DD card, file not opened.     (Missing / Misspelled DD name, Read / Write to un-opened dataset, Read to dataset that opened in       OUTPUT mode, Please try to save this file elsewhere. [ERROR_LOST_WRITEBEHIND_DATA_NETWORK_DISCONNECTED (0x314)]Error Code 789: {Delayed Write Failed} Windows was unable to save all the data for the file %hs; the data has been lost.

c.. ......| +0020 1A2579BC 58B0C048 4730B02C 5B20C010 5D20C00C 10225020 836045E0 922E4830 A06A5A30 |........$...).....&.c-..k.....!.| Storage around GPR12(1A2550FC) -0020 1A2550DC 70001A27 6FD80000 00050000 00000000 00000000 00000000 00000000 00000000 |....?Q..........................| NAME- TOTAL CPU TIME= .00 TOTAL ELAPSED TIME= .02 21.05.32 JOB02065 $HASP395 BILLING ENDED ------ JES2 JOB STATISTICS ------ 15 DEC 2011 JOB EXECUTION DATE 26 This error was returned by the server on which the file exists.