Home > Error In > Jar Error In Opening Zip File

Jar Error In Opening Zip File

Contents

When I tried doing Maven Install with the embedded version I got a similar zip file type of error: [ERROR] Failed to parse plugin descriptor for org.apache.maven.plugins:maven-install-plugin:2.3.1 (C:\Users\\.m2\repository\org\apache\maven\plugins\maven-install-plugin] ->.3.1\maven-install-plugin-2.3.1.jar): error in Reload to refresh your session. Config details: *** Date: Thursday, February 27, 2014 at 4:46:24 PM Eastern Standard Time *** Platform Details: *** System properties: applicationXMI=org.eclipse.ui.workbench/LegacyIDE.e4xmi awt.toolkit=sun.awt.windows.WToolkit com.genuitec.pulse.delivery.mpc.include.default=true com.genuitec.pulse.delivery.mpc.include.from.extension.points=true com.genuitec.pulse.delivery.mpc.include.patterns=^http://marketplace.eclipse.org.* com.genuitec.pulse.profile.install.directory=C:\Users\Tony\AppData\Local\MyEclipse Professional 2014 eclipse.commands=-os win32 -ws So i am trying to install without skipping these tests. http://rsmasters.net/error-in/jar-error-in-opening-zip-file-maven.html

SKIPPED [INFO] site .............................................. Please share the .log file which is located at /.metadata/.log and send it over to help us investigate further. I'm willing to bet it has HTML content rather than being a proper Java binary jar file. Tags Spaces API Connect Appsecdev BPM Blockchain Bluemix CICS Cloud Analytics Cloud marketplace Content Services (ECM) Continuous Testing Courses DB2 LUW DataPower Decision Optimization DevOps Services Digital Experience Hadoop IBM Design

Error In Opening Zip File Java

As for the relative classpath ordeal, it actually IS absolutely necessary, because these packages will be run on different machines, therefore working from the home directory might not always get the This type of issue is best addressed in our forum. mvn clean install -X > d:\log.txt And in the log file you find messages like these: Downloading: https://repository.apache.org/content/groups/public/org/apache/axis2/mex/1.6.1-wso2v2/mex-1.6.1-wso2v2-impl.jar [DEBUG] Writing resolution tracking file D:\wso2_local_repository\org\apache\axis2\mex\1.6.1-wso2v2\mex-1.6.1-wso2v2-impl.jar.lastUpdated Downloading: http://maven.wso2.org/nexus/content/groups/wso2-public/org/apache/axis2/mex/1.6.1-wso2v2/mex-1.6.1-wso2v2-impl.jar You see, Maven switched repository.apache.org

  • Are you using a Maven 3.1 compatible repository ?
  • When the proper way to get the new one fails, manually grab it yourself.
  • You will quickly see that that error messages after the first one are a result of the compiler being unable to find the package within the package being unzipped, and thus
  • Sci-Fi movie, about binary code, aliens, and headaches Vertical alignment of tikz circle in equation Working without compensation, what to do?
  • Can you open the file in Notepad or vi and see what it looks like?
  • Might be a silly question, but how did you import your jar?
  • That's not right, is it?
  • Viewing 15 posts - 1 through 15 (of 15 total) Author Posts February 27, 2014 at 3:48 pm #347605 Reply trantParticipant I tried to import an existing Maven project using the
  • Please use version 9 or higher to avoid problems with your order(s).

Test set: org.openmrs.api.UserServiceTest ------------------------------------------------------------------------------- Tests run: 80, Failures: 1, Errors: 0, Skipped: 1, Time elapsed: 4.811 sec <<< FAILURE! - in org.openmrs.api.UserServiceTest getAllPrivileges_shouldReturnAllPrivilegesInTheSystem(org.openmrs.api.UserServiceTest) Time elapsed: 0.07 sec <<< FAILURE! share|improve this answer answered May 19 '14 at 6:51 user3413464 211 add a comment| up vote 1 down vote This error can occur when your connection gets interrupted during your dependencies You can also update the path so that it uses a fileset so you do not have to update it every time you add a new dependency. Maven-clean-plugin-2.4.1.jar) Error In Opening Zip File Not the answer you're looking for?

All the best… Rate this:Like this:Like Loading... Error In Opening Zip File Jenkins Thank you for your feedback! hope that help as this answer helped me. –German Attanasio Jul 21 '14 at 17:45 add a comment| up vote 0 down vote I was facing the same issue just now. compile) then Run.

Using java 1.5 caused a compilation error after I got the jars working. Javac Error In Opening Zip File Insert a period / full stop if caption argument doesn't end with one Is it ok to turn down a promotion? Why is your answer not THE answer? Any thoughts?

Error In Opening Zip File Jenkins

However the error remains in my project ("Cannot read lifecycle mapping metadata for artifact …. more stack exchange communities company blog Stack Exchange Inbox Reputation and Badges sign up log in tour help Tour Start here for a quick overview of the site Help Center Detailed Error In Opening Zip File Java You could also use the debug setting on a maven run in MyEclipse, which would hopefully give a fuller picture when running from within MyEclipse. Error In Opening Zip File Ant Wayne Index of /maven2/org/apache/maven/plugins/maven-clean-plugin/2.4.1/ ../ maven-clean-plugin-2.4.1-javadoc.jar 08-May-2010 15:08 35680 maven-clean-plugin-2.4.1-javadoc.jar.asc 08-May-2010 15:08

Vertical alignment of tikz circle in equation Spaced-out numbers Process for valuing items for customs purposes at the Canadian border What would You-Know-Who want with Lily Potter? http://rsmasters.net/error-in/java-util-zip-zipexception-error-in-opening-zip-file-tomcat.html Are you behind a firewall or proxy ? 3. share|improve this answer answered Jan 4 '12 at 20:31 Darkaico 56658 2 It seems not work,I delete the ./m2/repository folder again and again,but still fail. –janwen Jul 5 '12 at posted 4 years ago Hi Ryan Dowdy, Welcome to CodeRanch! Error In Opening Zip File Gradle

Comment People who like this Close 0 Show 5 Share 10 |3000 characters needed characters left characters exceeded Viewable by all users Viewable by moderators Viewable by moderators First I will give the error message. Want to make things right, don't know with whom more hot questions question feed lang-xml about us tour help blog chat data legal privacy policy work here advertising info mobile contact navigate here Here is the console output displayed when debugging as maven build w/ goal of ‘compile': Apache Maven 3.0.5 (r01de14724cdef164cd33c7c8c2fe155faf9602da; 2013-02-19 08:51:28-0500) Maven home: C:\apache-maven-3.0.5 Java version: 1.7.0_45, vendor: Oracle Corporation Java

I thought by deleting the whole .m2 folder, then running maven install using 3.0.5 would ensure the repository would be 3.0 compatible. Error In Opening Zip File Eclipse package includes compile and install includes package. This is mere speculation.

I am merely testing it.

Change the file extension from .jar to .txt and open it in Notepad to inspect the contents. Downloading: http://repo1.maven.org/maven2/org/apache/maven/plugins/maven-surefire-plugin/2.7.1/maven-surefire-plugin-2.7.1.pom Downloaded: http://repo1.maven.org/maven2/org/apache/maven/plugins/maven-surefire-plugin/2.7.1/maven-surefire-plugin-2.7.1.pom (10 KB at 28.9 KB/sec) Downloading: http://repo1.maven.org/maven2/org/apache/maven/surefire/surefire/2.7.1/surefire-2.7.1.pom Downloaded: http://repo1.maven.org/maven2/org/apache/maven/surefire/surefire/2.7.1/surefire-2.7.1.pom (10 KB at 40.7 KB/sec) Downloading: http://repo1.maven.org/maven2/org/apache/maven/maven-parent/18/maven-parent-18.pom Downloaded: http://repo1.maven.org/maven2/org/apache/maven/maven-parent/18/maven-parent-18.pom (24 KB at 74.0 KB/sec) Downloading: http://repo1.maven.org/maven2/org/apache/apache/8/apache-8.pom Downloaded: http://repo1.maven.org/maven2/org/apache/apache/8/apache-8.pom share|improve this answer answered Mar 7 '13 at 15:17 John Niedzwiecki 1945 add a comment| up vote 3 down vote go to the .m2/repository and delete the conflicting files mvn -U Checksum Validation Failed Maven It then still failed on the asm-parent, which was a POM file containing the HTML with a 301.

Post Reply Bookmark Topic Watch Topic New Topic Similar Threads java.io.IOException: Corrupt GZIP trailer decodeStream() OR Put large file in ASSETS folder How to unzip password protected zip file in java? I had a problem with asm-3.1 (as mentioned in the blog post linked by Takahiko. Why is this not selected as the correct answer? –Swapnil Nov 6 '12 at 16:48 2 Oh really! his comment is here At first i was having test failure and the build fails.

The mapss package: I suspect that (if you look at the command prompt image, you will see this) because there are no class files in the dif directory itself, perhaps this java hibernate maven log4j slf4j share|improve this question edited May 3 at 11:34 R O M A N I A 12.5k116676 asked Mar 2 '12 at 0:33 user986474 1812420 Here is my fork of your project: RetailServletSoloTest You could try getting it from that. Thanks Ivange Larry.

FAILURE [2.291s] [INFO] admin ............................................. Please ignore. That jar was corrupt. I used the same version and got it working, after removing it and then reimporting.

Is it illegal for regular US citizens to possess or read the Podesta emails published by WikiLeaks? Indeed, I received an error message, but it was different this time. March 3, 2014 at 10:07 am #347684 Reply trantParticipant OK, thank you for the explanation. keyword2 keyword1 +keyword2 Questions excluding a word, e.g.

Build failure. 0 Maven tries to download older version of maven-clean-plugin and gives 'failed to parse plugin descriptor' error 5 Scala SBT / Maven2 Error on OSX: “Error Opening Zip File” current community chat Stack Overflow Meta Stack Overflow your communities Sign up or log in to customize your list. share|improve this answer edited Jun 1 '14 at 11:04 gsamaras 20.2k163675 answered Jan 31 '14 at 10:14 Shilpa 106211 This worked for me, surprisingly enough. –Jared Jul 17 '14 removed the files from /.m2/repository/ and build again –minhas23 Sep 6 at 9:06 add a comment| up vote 3 down vote I had a similar problem as well.

Not the answer you're looking for? Looks like you have a Maven 3.1 compatible local repository.MyEclipse 2014 supports Maven 3.0.x. How do I resolve this? But when i run this test case in eclipse, i get no failures.