Home > Error In > Jar Error In Opening Zip File Maven

Jar Error In Opening Zip File Maven

Contents

Did you use the same one and just re-add it or did you find another? You could also use the debug setting on a maven run in MyEclipse, which would hopefully give a fuller picture when running from within MyEclipse. asked 4 years ago viewed 21064 times active 3 months ago Blog Stack Overflow Podcast #91 - Can You Stump Nick Craver? March 5, 2014 at 5:59 am #347763 Reply support-swapnaModerator Trant, Thank you for the log file. 1. http://rsmasters.net/error-in/java-util-zip-zipexception-error-in-opening-zip-file-maven.html

Its dependencies (if any) will NOT be available to the current build. [WARNING] POM for 'com.fasterxml.jackson.core:jackson-core:pom:2.0.0:compile' is invalid. In it, you'll get: The week's top questions and answers Important community announcements Questions that need answers see an example newsletter By subscribing, you agree to the privacy policy and terms string.find versus this function How to find positive things in a code review? Thanks a ton.

Error In Opening Zip File Java

I am not sure. Rename the file to .txt before attaching it. 1. jacek (jack k) 2015-07-17 13:23:58 UTC #2 I have the same error.

Word for people or group(s) that will receive message How to know if a meal was cooked with or contains alcohol? But i get the following error: [ERROR] Error resolving version for plugin 'org.openmrs.maven.plugins:openmrs-sdk-maven-plugin' from the repositories [local (/home/m0dz3r0/.m2/repository), central (https://repo.maven.apache.org/maven2)]: Plugin not found in any plugin repository -> [Help 1] It The one I got came in a zip. Maven-clean-plugin-2.4.1.jar) Error In Opening Zip File Related 0Build issue Spring 3 -hibernate 3 Project1Spring Struts Hibernate Maven Project Error0Maven Throwing error in opening zip file?2log4j appender : buffered holder: only write to file on error0Spring 3.1.2 dependency

Config details: *** Date: Thursday, February 27, 2014 at 4:46:24 PM Eastern Standard Time *** Platform Details: *** System properties: applicationXMI=org.eclipse.ui.workbench/LegacyIDE.e4xmi awt.toolkit=sun.awt.windows.WToolkit com.genuitec.pulse.delivery.mpc.include.default=true com.genuitec.pulse.delivery.mpc.include.from.extension.points=true com.genuitec.pulse.delivery.mpc.include.patterns=^http://marketplace.eclipse.org.* com.genuitec.pulse.profile.install.directory=C:\Users\Tony\AppData\Local\MyEclipse Professional 2014 eclipse.commands=-os win32 -ws Error In Opening Zip File Jenkins Browse other questions tagged maven or ask your own question. That is wildly inaccurate, unless you meant 23 KB? ivange94 (Ivange Larry Ndumbe) 2015-07-17 17:26:15 UTC #3 i have skipped the sdk installation and proceeded to creating my introductory module using maven archetype mvn module-wizard:generate.

I was able to get a successful build eventually. Error In Opening Zip File Eclipse Reload to refresh your session. Why is your answer not THE answer? Can you help me then with the other problem I get when I try to use the embedded version of Maven, or even if I download version 3.0.5 separately?

  1. People who like this Close 0 Comment 10 |3000 characters needed characters left characters exceeded Viewable by all users Viewable by moderators Viewable by moderators and the original poster Viewable
  2. Clean your .m2\repository or delete your specific folders from the .m2\repository directory step2.
  3. Using java 1.5 caused a compilation error after I got the jars working.
  4. You can also update the path so that it uses a fileset so you do not have to update it every time you add a new dependency.
  5. Standardisation of Time in a FTL Universe Why did Moody eat the school's sausages?
  6. Why can't maven handle that?
  7. I thought by deleting the whole .m2 folder, then running maven install using 3.0.5 would ensure the repository would be 3.0 compatible.
  8. Find the Centroid of a Polygon What are the legal consequences for a tourist who runs out of gas on the Autobahn? "I am finished" vs "I have finished" Why does
  9. Where are sudo's insults stored?
  10. Please share the .log file which is located at /.metadata/.log and send it over to help us investigate further.

Error In Opening Zip File Jenkins

Farming after the apocalypse: chickens or giant cockroaches? Not behind a proxy. Error In Opening Zip File Java java hibernate maven log4j slf4j share|improve this question edited May 3 at 11:34 R O M A N I A 12.5k116676 asked Mar 2 '12 at 0:33 user986474 1812420 Error In Opening Zip File Android Studio Can you open the file in Notepad or vi and see what it looks like?

mvn clean install share|improve this answer answered Jan 19 '15 at 4:55 Anuruddha lanka Liyanarachchi 338216 add a comment| up vote -1 down vote Accidently I found a simple workaroud to check over here I am using separately download Maven 3.1.1 instead of embedded version. Join them; it only takes a minute: Sign up maven install throw “error in opening zip file” only after the second try up vote 5 down vote favorite 1 I try Comment People who like this Close 0 Show 5 Share 10 |3000 characters needed characters left characters exceeded Viewable by all users Viewable by moderators Viewable by moderators Error In Opening Zip File Ant

maven share|improve this question edited May 3 at 11:30 R O M A N I A 12.5k116676 asked Sep 29 '11 at 15:53 UnKnown 5,61742147244 try: mvn -U clean SKIPPED [INFO] ------------------------------------------------------------------------ [INFO] BUILD FAILURE [INFO] ------------------------------------------------------------------------ [INFO] Total time: 2.976s [INFO] Finished at: Sun Feb 16 04:32:38 EST 2014 [INFO] Final Memory: 10M/90M [INFO] ------------------------------------------------------------------------ [ERROR] Failed to execute If you are using a Maven 3.1 compatible local repository, there will be errors as embedded Maven is 3.0 and it cannot work with a Maven 3.1 repository. 2. http://rsmasters.net/error-in/jar-error-in-opening-zip-file.html Thank you for your feedback!

I get the same error either case: [INFO] Scanning for projects... [INFO] [INFO] ------------------------------------------------------------------------ [INFO] Building maven 0.0.1-SNAPSHOT [INFO] ------------------------------------------------------------------------ [WARNING] The POM for org.apache.maven.plugins:maven-install-plugin:jar:2.3.1 is invalid, transitive dependencies (if any) Checksum Validation Failed Maven Recruiter wants me to take a loss upon hire Can a GM prohibit players from using external reference materials (like PHB) during play? That worked for me. –shashaDenovo Dec 13 '14 at 10:15 1 Worked good for me too...

FAILURE [2.291s] [INFO] admin .............................................

Try again and make sure the broken files aren't there before re-running maven. –jrudolph Jun 18 '15 at 5:59 add a comment| 3 Answers 3 active oldest votes up vote 4 Test set: org.openmrs.api.UserServiceTest ------------------------------------------------------------------------------- Tests run: 80, Failures: 1, Errors: 0, Skipped: 1, Time elapsed: 4.811 sec <<< FAILURE! - in org.openmrs.api.UserServiceTest getAllPrivileges_shouldReturnAllPrivilegesInTheSystem(org.openmrs.api.UserServiceTest) Time elapsed: 0.07 sec <<< FAILURE! Click on button keeps the box moving for thrice Translation of "the article says" Should a spacecraft be launched towards the East? Javac Error In Opening Zip File Edit: I may have spoken too soon, now I am getting that first error again (and it's Maven 3.0.5) Description Resource Path Location Type Cannot read lifecycle mapping metadata for artifact

Already have an account? Can you please let us know what happens when you right click on project -> Run As -> Maven build ? 2. java.runtime.name=Java(TM) SE Runtime Environment java.runtime.version=1.7.0_45-b18 java.specification.name=Java Platform API Specification java.specification.vendor=Oracle Corporation java.specification.version=1.7 java.vendor=Oracle Corporation java.vendor.url=http://java.oracle.com/ java.vendor.url.bug=http://bugreport.sun.com/bugreport/ java.version=1.7.0_45 java.vm.info=mixed mode java.vm.name=Java HotSpot(TM) 64-Bit Server VM java.vm.specification.name=Java Virtual Machine Specification java.vm.specification.vendor=Oracle Corporation java.vm.specification.version=1.7 weblink Show more comments Your answer Text editing toolbar Hint: You can notify a user about this post by typing @username.

At first i was having test failure and the build fails. How do I resolve this? When you start maven with a lifecycle phase, it will also execute all phases before that phase. Thanks Ivange Larry.

Please ignore. Here is the console output displayed when debugging as maven build w/ goal of ‘compile': Apache Maven 3.0.5 (r01de14724cdef164cd33c7c8c2fe155faf9602da; 2013-02-19 08:51:28-0500) Maven home: C:\apache-maven-3.0.5 Java version: 1.7.0_45, vendor: Oracle Corporation Java SLF4J: Defaulting to no-operation (NOP) logger implementation SLF4J: See http://www.slf4j.org/codes.html#StaticLoggerBinder for further details. Browse other questions tagged java hibernate maven log4j slf4j or ask your own question.

Downloading: http://repo1.maven.org/maven2/org/apache/maven/plugins/maven-surefire-plugin/2.7.1/maven-surefire-plugin-2.7.1.pom Downloaded: http://repo1.maven.org/maven2/org/apache/maven/plugins/maven-surefire-plugin/2.7.1/maven-surefire-plugin-2.7.1.pom (10 KB at 28.9 KB/sec) Downloading: http://repo1.maven.org/maven2/org/apache/maven/surefire/surefire/2.7.1/surefire-2.7.1.pom Downloaded: http://repo1.maven.org/maven2/org/apache/maven/surefire/surefire/2.7.1/surefire-2.7.1.pom (10 KB at 40.7 KB/sec) Downloading: http://repo1.maven.org/maven2/org/apache/maven/maven-parent/18/maven-parent-18.pom Downloaded: http://repo1.maven.org/maven2/org/apache/maven/maven-parent/18/maven-parent-18.pom (24 KB at 74.0 KB/sec) Downloading: http://repo1.maven.org/maven2/org/apache/apache/8/apache-8.pom Downloaded: http://repo1.maven.org/maven2/org/apache/apache/8/apache-8.pom Is that incorrect? 2. share|improve this answer answered Aug 21 '14 at 6:14 Mureinik 103k2054103 2 I tried that but error still . Please see attached file Attachments:You must be logged in to view attached files.

Why aren't sessions exclusive to an IP address? You may want to check what settings XML to see if you're set to a different repository, such as a local nexus server. What is the 'dot space filename' command doing in bash? The module is been generated successfully but when i run mvn clean install inside the module parent directory i get the following errors. [ERROR] Failed to execute goal org.apache.maven.plugins:maven-compiler-plugin:3.1:testCompile (default-testCompile) on

keyword2 keyword1 -keyword2 Questions with a specific tag and keyword(s) +[tag1] keyword1 Questions with two or more specific tags and keyword(s) +[tag1] +[tag2] keyword1 To search for all posts by a Chris Jenkins (1490) OliverRodriguez (7) Mar 19, 2015 at 11:29 AM 0 I'm not sure. Process for valuing items for customs purposes at the Canadian border Farming after the apocalypse: chickens or giant cockroaches?